Target
Proteinase-activated receptor 2
Ligand
BDBM85516
Substrate
Ki
2300±n/a nM
Comments
PDSP_1433
Citation
 Al-Ani, BSaifeddine, MKawabata, ARenaux, BMokashi, SHollenberg, MD Proteinase-activated receptor 2 (PAR(2)): development of a ligand-binding assay correlating with activation of PAR(2) by PAR(1)- and PAR(2)-derived peptide ligands. J Pharmacol Exp Ther 290:753-60 (1999) Target
Name:
Proteinase-activated receptor 2
Synonyms:
F2rl1 Par2
Type:
Enzyme Catalytic Domain
Mol. Mass.:
44466.34
Organism:
RAT
Description:
PAR2 F2RL1 RAT::Q63645
Residue:
397
  
Inhibitor
Name:
BDBM85516
Synonyms:
CAS_141923-41-3 SFLLR-NH2
Type:
Small organic molecule
Emp. Form.:
C30H51N9O6
Mol. Mass.:
633.7826
SMILES:
[#6]-[#6](-[#6])-[#6]-[#6@H](-[#7]-[#6](=O)-[#6@H](-[#6]-[#6](-[#6])-[#6])-[#7]-[#6](=O)-[#6@H](-[#6]-c1ccccc1)-[#7]-[#6](=O)-[#6@@H](-[#7])-[#6]-[#8])-[#6](=O)-[#7]-[#6@@H](-[#6]-[#6]-[#6]\[#7]=[#6](\[#7])-[#7])-[#6](-[#7])=O
: