Target
5-hydroxytryptamine receptor 2A
Ligand
BDBM50249134
Substrate
Ki
501.19±n/a nM
Comments
PDSP_3873
Citation
 Bonhaus, DWFlippin, LAGreenhouse, RJJaime, SRocha, CDawson, MVan Natta, KChang, LKPulido-Rios, TWebber, ALeung, EEglen, RMMartin, GR RS-127445: a selective, high affinity, orally bioavailable 5-HT2B receptor antagonist. Br J Pharmacol 127:1075-82 (1999)  
Target
Name:
5-hydroxytryptamine receptor 2A
Synonyms:
5-HT-2 5-HT2A 5-hydroxytryptamine receptor 2A (5HT-2A) 5HT2A_HUMAN HTR2A | Serotonin receptor 2A
Type:
undefined
Mol. Mass.:
52607.65
Organism:
Homo sapiens (Human)
Description:
P28223
Residue:
471
  
Inhibitor
Name:
BDBM50249134
Synonyms:
4-(4-fluoronaphthalen-1-yl)-6-isopropylpyrimidin-2-amine RS-127445
Type:
Small organic molecule
Emp. Form.:
C17H16FN3
Mol. Mass.:
281.3274
SMILES:
CC(C)c1cc(nc(N)n1)-c1ccc(F)c2ccccc12
: