Target
Mu-type opioid receptor
Ligand
BDBM50016847
Substrate
Ki
8.1±n/a nM
Comments
PDSP_4621
Citation
 Márki, AMonory, KOtvös, FTóth, GKrassnig, RSchmidhammer, HTraynor, JRRoques, BPMaldonado, RBorsodi, A Mu-opioid receptor specific antagonist cyprodime: characterization by in vitro radioligand and [35S]GTPgammaS binding assays. Eur J Pharmacol 383:209-14 (1999)  
Target
Name:
Mu-type opioid receptor
Synonyms:
MOR-1 Mu-type opioid receptor (MOR) OPRM_RAT Opioid receptor B Ror-b
Type:
G Protein-Coupled Receptor (GPCR)
Mol. Mass.:
44503.11
Organism:
Rattus norvegicus (rat)
Description:
Competition binding assays were carried out using membrane preparations from transfected HN9.10 cells that constitutively expressed the mu opioid receptor.
Residue:
398
  
Inhibitor
Name:
BDBM50016847
Synonyms:
CHEMBL337041 | Cyprodime
Type:
Small organic molecule
Emp. Form.:
C22H29NO3
Mol. Mass.:
355.4706
SMILES:
COc1cccc2CC3N(CC4CC4)CC[C@@]4(CC(=O)CC[C@@]34OC)c12
: