Target
Prostaglandin E2 receptor EP4 subtype
Ligand
BDBM85184
Substrate
Ki
>10000±n/a nM
Comments
PDSP_257
Citation
 Abramovitz, MAdam, MBoie, YCarrière, MDenis, DGodbout, CLamontagne, SRochette, CSawyer, NTremblay, NMBelley, MGallant, MDufresne, CGareau, YRuel, RJuteau, HLabelle, MOuimet, NMetters, KM The utilization of recombinant prostanoid receptors to determine the affinities and selectivities of prostaglandins and related analogs. Biochim Biophys Acta 1483:285-93 (2000)  
Target
Name:
Prostaglandin E2 receptor EP4 subtype
Synonyms:
PE2R4_HUMAN PGE2 receptor EP4 subtype PTGER4 Prostanoid EP4 receptor
Type:
Enzyme
Mol. Mass.:
53134.53
Organism:
Homo sapiens (Human)
Description:
P35408
Residue:
488
  
Inhibitor
Name:
BDBM85184
Synonyms:
AH-6809 NSC_119461
Type:
Small organic molecule
Emp. Form.:
C17H14O5
Mol. Mass.:
298.2901
SMILES:
CC(C)Oc1ccc2c(c1)oc1ccc(cc1c2=O)C(O)=O
: