Target
5-hydroxytryptamine receptor 2B
Ligand
BDBM50050467
Substrate
Ki
630.96±n/a nM
Comments
PDSP_3305
Citation
 Millan, MJGobert, ANewman-Tancredi, ALejeune, FCussac, DRivet, JMAudinot, VDubuffet, TLavielle, G S33084, a novel, potent, selective, and competitive antagonist at dopamine D(3)-receptors: I. Receptorial, electrophysiological and neurochemical profile compared with GR218,231 and L741,626. J Pharmacol Exp Ther 293:1048-62 (2000) Target
Name:
5-hydroxytryptamine receptor 2B
Synonyms:
5-HT-2B 5-hydroxytryptamine (serotonin) receptor 2B [Homo sapiens] 5-hydroxytryptamine receptor 2C (5HT2C) HTR2B Serotonin 2b (5-HT2b) receptor | Serotonin Receptor 2B
Type:
G Protein-Coupled Receptor (GPCR)
Mol. Mass.:
54312.47
Organism:
Homo sapiens (Human)
Description:
Receptor binding assays were performed using human clone stably expressed in CHO cells.
Residue:
481
  
Inhibitor
Name:
BDBM50050467
Synonyms:
1-((1H-indol-3-yl)methyl)-4-(4-chlorophenyl)piperidin-4-ol 4-(4-Chloro-phenyl)-1-(1H-indol-3-ylmethyl)-piperidin-4-ol L-741626 | L741,626
Type:
Small organic molecule
Emp. Form.:
C20H21ClN2O
Mol. Mass.:
340.847
SMILES:
OC1(CCN(Cc2c[nH]c3ccccc23)CC1)c1ccc(Cl)cc1
: