Target
Alpha-1A adrenergic receptor
Ligand
BDBM50050467
Substrate
Ki
251.19±n/a nM
Comments
PDSP_3305
Citation
 Millan, MJGobert, ANewman-Tancredi, ALejeune, FCussac, DRivet, JMAudinot, VDubuffet, TLavielle, G S33084, a novel, potent, selective, and competitive antagonist at dopamine D(3)-receptors: I. Receptorial, electrophysiological and neurochemical profile compared with GR218,231 and L741,626. J Pharmacol Exp Ther 293:1048-62 (2000) Target
Name:
Alpha-1A adrenergic receptor
Synonyms:
ADA1A_RAT Adra1c Alpha-1A adrenoceptor Alpha-1C adrenergic receptor | adrenergic Alpha1A
Type:
Protein
Mol. Mass.:
51620.15
Organism:
Rattus norvegicus (Rat)
Description:
P43140
Residue:
466
  
Inhibitor
Name:
BDBM50050467
Synonyms:
1-((1H-indol-3-yl)methyl)-4-(4-chlorophenyl)piperidin-4-ol 4-(4-Chloro-phenyl)-1-(1H-indol-3-ylmethyl)-piperidin-4-ol L-741626 | L741,626
Type:
Small organic molecule
Emp. Form.:
C20H21ClN2O
Mol. Mass.:
340.847
SMILES:
OC1(CCN(Cc2c[nH]c3ccccc23)CC1)c1ccc(Cl)cc1
: