Target
Metabotropic glutamate receptor 1
Ligand
BDBM50030630
Substrate
Ki
>10000±n/a nM
Comments
PDSP_3105
Citation
 Mutel, VEllis, GJAdam, GChaboz, SNilly, AMesser, JBleuel, ZMetzler, VMalherbe, PSchlaeger, EJRoughley, BSFaull, RLRichards, JG Characterization of [(3)H]Quisqualate binding to recombinant rat metabotropic glutamate 1a and 5a receptors and to rat and human brain sections. J Neurochem 75:2590-601 (2000)  
Target
Name:
Metabotropic glutamate receptor 1
Synonyms:
GPRC1A GRM1_HUMAN Metabotropic Glutamate 1a | metabotropic glutamate 1
Type:
Enzyme
Mol. Mass.:
132358.19
Organism:
Homo sapiens (Human)
Description:
Q13255
Residue:
1194
  
Inhibitor
Name:
BDBM50030630
Synonyms:
(RS)-1-aminoindan-1,5-dicarboxylic acid 1-Amino-indan-1,5-dicarboxylic acid(RS-AIDA) AIDC GNF-Pf-1401
Type:
Small organic molecule
Emp. Form.:
C11H11NO4
Mol. Mass.:
221.2093
SMILES:
NC1(CCc2cc(ccc12)C(O)=O)C(O)=O
: