Target
Alpha-1A adrenergic receptor
Ligand
BDBM50241196
Substrate
Ki
199.5265±n/a nM
Comments
PDSP_3304
Citation
 Millan, MJDekeyne, ANewman-Tancredi, ACussac, DAudinot, VMilligan, GDuqueyroix, DGirardon, SMullot, JBoutin, JANicolas, JPRenouard-Try, ALacoste, JMCordi, A S18616, a highly potent, spiroimidazoline agonist at alpha(2)-adrenoceptors: I. Receptor profile, antinociceptive and hypothermic actions in comparison with dexmedetomidine and clonidine. J Pharmacol Exp Ther 295:1192-205 (2000) Target
Name:
Alpha-1A adrenergic receptor
Synonyms:
ADA1A_HUMAN ADRA1C Alpha 1A-adrenoceptor Alpha adrenergic receptor 1a Alpha-adrenergic receptor 1c adrenergic Alpha1 | adrenergic Alpha1C
Type:
Cell-surface receptors
Mol. Mass.:
51511.67
Organism:
Homo sapiens (Human)
Description:
P35348
Residue:
466
  
Inhibitor
Name:
BDBM50241196
Synonyms:
(R)-5-(1-(2,3-dimethylphenyl)ethyl)-1H-imidazole CHEMBL397901 | Dexmedetomidine
Type:
Small organic molecule
Emp. Form.:
C13H16N2
Mol. Mass.:
200.2795
SMILES:
C[C@@H](c1cnc[nH]1)c1cccc(C)c1C
: