Target
Cysteinyl leukotriene receptor 2
Ligand
BDBM50009073
Substrate
Ki
1000±n/a nM
Comments
PDSP_1992
Citation
 Nothacker, HPWang, ZZhu, YReinscheid, RKLin, SHCivelli, O Molecular cloning and characterization of a second human cysteinyl leukotriene receptor: discovery of a subtype selective agonist. Mol Pharmacol 58:1601-8 (2000)  
Target
Name:
Cysteinyl leukotriene receptor 2
Synonyms:
CLTR2_HUMAN CYSLT2R Cysteinyl leukotriene receptor Leukotriene Cysteinyl 2
Type:
Enzyme Catalytic Domain
Mol. Mass.:
39657.52
Organism:
Homo sapiens (Human)
Description:
Leukotriene Cysteinyl 2 CYSLTR2 HUMAN::Q9NS75
Residue:
346
  
Inhibitor
Name:
BDBM50009073
Synonyms:
4-(5-cyclopentyloxycarbonylamino-1-methyl-1H-indol-3-ylmethyl)-3-methoxy-N-o-tolylsulfonylbenzamide ZAFIRLUKAST cyclopentyl 3-[2-methoxy-4-(2-methylphenylsulfonylcarbamoyl)benzyl]-1-methyl-1H-indol-5-ylcarbamate
Type:
Small organic molecule
Emp. Form.:
C31H33N3O6S
Mol. Mass.:
575.675
SMILES:
COc1cc(ccc1Cc1cn(C)c2ccc(NC(=O)OC3CCCC3)cc12)C(=O)NS(=O)(=O)c1ccccc1C
: