Target
5-hydroxytryptamine receptor 4
Ligand
BDBM50005836
Substrate
Ki
39.8±n/a nM
Comments
PDSP_530
Citation
 Bach, TSyversveen, TKvingedal, AMKrobert, KABrattelid, TKaumann, AJLevy, FO 5HT4(a) and 5-HT4(b) receptors have nearly identical pharmacology and are both expressed in human atrium and ventricle. Naunyn Schmiedebergs Arch Pharmacol 363:146-60 (2001)  
Target
Name:
5-hydroxytryptamine receptor 4
Synonyms:
5-HT-4 5-HT4S 5-HT4b 5-HT4d 5-hydroxytryptamine receptor 4 5HT4R_HUMAN Serotonin (5-HT) receptor Serotonin 4 (5-HT4) receptor | Serotonin Receptor 4
Type:
Enzyme
Mol. Mass.:
43767.54
Organism:
Homo sapiens (Human)
Description:
Q13639
Residue:
388
  
Inhibitor
Name:
BDBM50005836
Synonyms:
4-Amino-5-chloro-N-{1-[3-(4-fluoro-phenoxy)-propyl]-3-methoxy-piperidin-4-yl}-2-methoxy-benzamide CHEMBL560739 PROPULSID US10800776, Example Cisapride cid_5311047
Type:
Small organic molecule
Emp. Form.:
C23H29ClFN3O4
Mol. Mass.:
465.945
SMILES:
COC1CN(CCCOc2ccc(F)cc2)CCC1NC(=O)c1cc(Cl)c(N)cc1OC
: