Target
Muscarinic acetylcholine receptor M1
Ligand
BDBM82372
Substrate
Ki
0.49±n/a nM
Comments
PDSP_983
Citation
 Hirose, HAoki, IKimura, TFujikawa, TNumazawa, TSasaki, KSato, AHasegawa, TNishikibe, MMitsuya, MOhtake, NMase, TNoguchi, K Pharmacological properties of (2R)-N-[1-(6-aminopyridin-2-ylmethyl)piperidin-4-yl]-2-[(1R)-3,3-difluorocyclopentyl]-2-hydroxy-2-phenylacetamide: a novel mucarinic antagonist with M(2)-sparing antagonistic activity. J Pharmacol Exp Ther 297:790-7 (2001) Target
Name:
Muscarinic acetylcholine receptor M1
Synonyms:
ACM1_HUMAN Cholinergic receptor, muscarinic 1 | Cholinergic, muscarinic M1
Type:
Protein
Mol. Mass.:
51442.54
Organism:
Homo sapiens (Human)
Description:
P11229
Residue:
460
  
Inhibitor
Name:
BDBM82372
Synonyms:
CAS_22254-24-6 NSC_3746
Type:
Small organic molecule
Emp. Form.:
C20H30NO3
Mol. Mass.:
332.4566
SMILES:
CC(C)[N+]1(C)C2CCC1CC(C2)OC(=O)C(CO)c1ccccc1
: