Target
Alpha-2A adrenergic receptor [16-465]
Ligand
BDBM50030623
Substrate
Ki
244±n/a nM
Comments
PDSP_1716
Citation
 Naselsky, DPAshton, DRuffolo, RRHieble, JP Rabbit alpha2-adrenoceptors: both platelets and adipocytes have alpha2A-pharmacology. J Pharmacol Exp Ther 298:219-25 (2001) Target
Name:
Alpha-2A adrenergic receptor [16-465]
Synonyms:
ADA2A_RAT Adrenaline 2 Alpha-2A adrenoceptor Alpha-2AAR Alpha2 Adrenoreceptor adrenergic Alpha2A
Type:
G-protein coupled receptor
Mol. Mass.:
48961.69
Organism:
Rattus norvegicus (rat)
Description:
P22909[16-465]
Residue:
450
  
Inhibitor
Name:
BDBM50030623
Synonyms:
6-Chloro-3-methyl-9-(3-methyl-but-2-enyloxy)-2,3,4,5-tetrahydro-1H-benzo[d]azepine SK&F-104078 SKF 104078
Type:
Small organic molecule
Emp. Form.:
C16H22ClNO
Mol. Mass.:
279.805
SMILES:
[#6]-[#7]-1-[#6]-[#6]-c2c(Cl)ccc(-[#8]-[#6]\[#6]=[#6](\[#6])-[#6])c2-[#6]-[#6]-1
: