Target
Prostaglandin-H2 D-isomerase
Ligand
BDBM85347
Substrate
Ki
2600±n/a nM
Comments
PDSP_459
Citation
 Arimura, AYasui, KKishino, JAsanuma, FHasegawa, HKakudo, SOhtani, MArita, H Prevention of allergic inflammation by a novel prostaglandin receptor antagonist, S-5751. J Pharmacol Exp Ther 298:411-9 (2001) Target
Name:
Prostaglandin-H2 D-isomerase
Synonyms:
PDS PTGDS | PTGDS_HUMAN
Type:
Enzyme Catalytic Domain
Mol. Mass.:
21031.11
Organism:
Homo sapiens (Human)
Description:
PGD2 0 HUMAN::P41222
Residue:
190
  
Inhibitor
Name:
BDBM85347
Synonyms:
BWA868C NSC_122021
Type:
Small organic molecule
Emp. Form.:
C25H37N3O5
Mol. Mass.:
459.5784
SMILES:
OC(CNn1c(CCCCCCC(O)=O)c(O)n(Cc2ccccc2)c1=O)C1CCCCC1
: