Target
Hrh3 protein
Ligand
BDBM22914
Substrate
Ki
6.46±n/a nM
Comments
PDSP_1847
Citation
 Wieland, KBongers, GYamamoto, YHashimoto, TYamatodani, AMenge, WMTimmerman, HLovenberg, TWLeurs, R Constitutive activity of histamine h(3) receptors stably expressed in SK-N-MC cells: display of agonism and inverse agonism by H(3) antagonists. J Pharmacol Exp Ther 299:908-14 (2001) Target
Name:
Hrh3 protein
Synonyms:
HISTAMINE H3 Hrh3 protein
Type:
Enzyme Catalytic Domain
Mol. Mass.:
37860.96
Organism:
RAT
Description:
Q5PPG3
Residue:
344
  
Inhibitor
Name:
BDBM22914
Synonyms:
CHEMBL260374 Thioperamide | US11622967, Compound Thioperamide
Type:
Small organic molecule
Emp. Form.:
C15H24N4S
Mol. Mass.:
292.443
SMILES:
S=C(NC1CCCCC1)N1CCC(CC1)c1cnc[nH]1
: