Target
Alpha-1B adrenergic receptor
Ligand
BDBM85848
Substrate
Ki
25.12±n/a nM
Comments
PDSP_2089
Citation
 Hancock, AABuckner, SABrune, MEEsbenshade, TAIreland, LMKatwala, SMilicic, IMeyer, MDKerwin, JFWilliams, M Preclinical pharmacology of fiduxosin, a novel alpha(1)-adrenoceptor antagonist with uroselective properties. J Pharmacol Exp Ther 300:478-86 (2002)  
Target
Name:
Alpha-1B adrenergic receptor
Synonyms:
ADA1B_HUMAN Adrenergic alpha1B Adrenergic receptor alpha Alpha 1B-adrenoreceptor | Alpha-1B adrenergic receptor
Type:
Enzyme
Mol. Mass.:
56862.13
Organism:
Homo sapiens (Human)
Description:
P35368
Residue:
520
  
Inhibitor
Name:
BDBM85848
Synonyms:
CAS_172307 NSC_172307
Type:
Small organic molecule
Emp. Form.:
C30H29N5O4S
Mol. Mass.:
555.647
SMILES:
COc1cccc2OCC3CN(CCCCn4c(=O)[nH]c5c6nc(cnc6sc5c4=O)-c4ccccc4)CC3c12
: