Target
Melanin-concentrating hormone receptor 2
Ligand
BDBM85948
Substrate
Ki
48±n/a nM
Comments
PDSP_2475
Citation
 Bednarek, MAHreniuk, DLTan, CPalyha, OCMacNeil, DJVan der Ploeg, LHHoward, ADFeighner, SD Synthesis and biological evaluation in vitro of selective, high affinity peptide antagonists of human melanin-concentrating hormone action at human melanin-concentrating hormone receptor 1. Biochemistry 41:6383-90 (2002)  
Target
Name:
Melanin-concentrating hormone receptor 2
Synonyms:
GPR145 MCHR2_HUMAN Melanin-concentrating hormone receptor SLT
Type:
Enzyme Catalytic Domain
Mol. Mass.:
38862.16
Organism:
Homo sapiens (Human)
Description:
Melanin Concentrating Hormone 2 GPR145 HUMAN::Q969V1
Residue:
340
  
Inhibitor
Name:
BDBM85948
Synonyms:
Gva6,Ava9,10
Type:
Small organic molecule
Emp. Form.:
C53H89N19O11S3
Mol. Mass.:
1264.589
SMILES:
[#6]-[#16]-[#6]-[#6]-[#6]-1-[#7]-[#6](=O)-[#6](-[#6]-[#16]-[#16]-[#6]-[#6](-[#7]-[#6](=O)-[#6]-2-[#6]-[#6]-[#6]-[#7]-2-[#6](=O)-[#6](-[#6]-[#6]-[#6]\[#7]=[#6](\[#7])-[#7])-[#7]-[#6](=O)-[#6](-[#6]-c2ccc(-[#8])cc2)-[#7]-[#6](=O)-[#6](-[#7]-[#6](=O)-[#6](-[#6]-[#6]-[#6]\[#7]=[#6](\[#7])-[#7])-[#7]-[#6](=O)-[#6]-[#6]-[#6]-[#6]-[#7]-[#6]-1=O)-[#6](-[#6])-[#6])-[#6](-[#7])=O)-[#7]-[#6](=O)-[#6]-[#6]-[#6]-[#6]\[#7]=[#6](\[#7])-[#7]
: