Target
5-hydroxytryptamine receptor 1A
Ligand
BDBM86053
Substrate
Ki
1698.24±n/a nM
Comments
PDSP_1791
Citation
 Millan, MJMaiofiss, LCussac, DAudinot, VBoutin, JANewman-Tancredi, A Differential actions of antiparkinson agents at multiple classes of monoaminergic receptor. I. A multivariate analysis of the binding profiles of 14 drugs at 21 native and cloned human receptor subtypes. J Pharmacol Exp Ther 303:791-804 (2002)  
Target
Name:
5-hydroxytryptamine receptor 1A
Synonyms:
5-HT-1A 5-hydroxytryptamine receptor 1A (5-HT-1A) ADRB2RL1 Dopamine D2 receptor and serotonin 1a receptor HTR1A | Serotonin receptor 1A
Type:
Mol. Mass.:
46122.49
Organism:
Homo sapiens (Human)
Description:
Residue:
422
  
Inhibitor
Name:
BDBM86053
Synonyms:
B-HT 920 CHEMBL279085 Talipexole | cid_5374
Type:
Small organic molecule
Emp. Form.:
C10H15N3S
Mol. Mass.:
209.311
SMILES:
Nc1nc2CCN(CC=C)CCc2s1
: