Target
Beta-1 adrenergic receptor
Ligand
BDBM50017550
Substrate
Ki
>10000±n/a nM
Comments
PDSP_1526
Citation
 Millan, MJMaiofiss, LCussac, DAudinot, VBoutin, JANewman-Tancredi, A Differential actions of antiparkinson agents at multiple classes of monoaminergic receptor. I. A multivariate analysis of the binding profiles of 14 drugs at 21 native and cloned human receptor subtypes. J Pharmacol Exp Ther 303:791-804 (2002)  
Target
Name:
Beta-1 adrenergic receptor
Synonyms:
ADRB1 ADRB1_HUMAN Beta-1 adrenoceptor | adrenergic Beta1
Type:
G Protein-Coupled Receptor (GPCR)
Mol. Mass.:
51338.40
Organism:
Homo sapiens (Human)
Description:
P08588
Residue:
477
  
Inhibitor
Name:
BDBM50017550
Synonyms:
CHEMBL76399 N*6*-Propyl-4,5,6,7-tetrahydro-benzothiazole-2,6-diamine (Pramipexole, PPX) | Pramipexole
Type:
Small organic molecule
Emp. Form.:
C10H17N3S
Mol. Mass.:
211.327
SMILES:
CCCNC1CCc2nc(N)sc2C1
: