Target
Orexin/Hypocretin receptor type 1
Ligand
BDBM163968
Substrate
Meas. Tech.
Radioligand Binding Assay
Temperature
277.15±n/a K
Ki
1500±n/a nM
Comments
extracted
Citation
 Coate, HRDvorak, CALebold, TPPreville, CShireman, BT Substituted 7-azabicycles and their use as orexin receptor modulators US Patent  US9695183 Publication Date 7/4/2017 
Target
Name:
Orexin/Hypocretin receptor type 1
Synonyms:
Hcrtr1 OX1R_RAT Orexin receptor type 1 (OX1R) Ox1-R | Ox1R
Type:
Protein
Mol. Mass.:
46817.55
Organism:
Rattus norvegicus (Rat)
Description:
P56718
Residue:
416
  
Inhibitor
Name:
BDBM163968
Synonyms:
US9062078, 99 US9637496, 99 | US9695183, 99
Type:
Small organic molecule
Emp. Form.:
C22H22FN5O3
Mol. Mass.:
423.4402
SMILES:
Cc1cc(on1)-c1ccc(C)nc1C(=O)N1C2CCC1C(COc1ncc(F)cn1)C2
: