Target
Orexin receptor type 2
Ligand
BDBM163968
Substrate
Meas. Tech.
Radioligand Binding Assay
Temperature
313.15±n/a K
Ki
2900±n/a nM
Comments
extracted
Citation
 Coate, HRDvorak, CALebold, TPPreville, CShireman, BT Substituted 7-azabicycles and their use as orexin receptor modulators US Patent  US9695183 Publication Date 7/4/2017 
Target
Name:
Orexin receptor type 2
Synonyms:
HCRTR2 OX2R_HUMAN Orexin receptor type 2 (OR-2) Orexin receptor type 2 (OX2R) Ox-2-R | Ox2-R
Type:
Protein
Mol. Mass.:
50710.53
Organism:
Homo sapiens (Human)
Description:
O43614
Residue:
444
  
Inhibitor
Name:
BDBM163968
Synonyms:
US9062078, 99 US9637496, 99 | US9695183, 99
Type:
Small organic molecule
Emp. Form.:
C22H22FN5O3
Mol. Mass.:
423.4402
SMILES:
Cc1cc(on1)-c1ccc(C)nc1C(=O)N1C2CCC1C(COc1ncc(F)cn1)C2
: