Target
Orexin/Hypocretin receptor type 1
Ligand
BDBM164112
Substrate
Meas. Tech.
Radioligand Binding Assay
Temperature
277.15±n/a K
Ki
31±n/a nM
Comments
extracted
Citation
 Coate, HRDvorak, CALebold, TPPreville, CShireman, BT Substituted 7-azabicycles and their use as orexin receptor modulators US Patent  US9695183 Publication Date 7/4/2017 
Target
Name:
Orexin/Hypocretin receptor type 1
Synonyms:
Hcrtr1 OX1R_RAT Orexin receptor type 1 (OX1R) Ox1-R | Ox1R
Type:
Protein
Mol. Mass.:
46817.55
Organism:
Rattus norvegicus (Rat)
Description:
P56718
Residue:
416
  
Inhibitor
Name:
BDBM164112
Synonyms:
US9062078, 242 US9637496, 242 | US9695183, 242
Type:
Small organic molecule
Emp. Form.:
C21H20F3N7O2
Mol. Mass.:
459.4244
SMILES:
COc1cccc(c1C(=O)N1C2CCC1C(C2)Nc1cnc(cn1)C(F)(F)F)-n1nccn1
: