Target
Orexin receptor type 2
Ligand
BDBM164140
Substrate
Meas. Tech.
Radioligand Binding Assay
Temperature
313.15±n/a K
Ki
145±n/a nM
Comments
extracted
Citation
 Coate, HRDvorak, CALebold, TPPreville, CShireman, BT Substituted 7-azabicycles and their use as orexin receptor modulators US Patent  US9695183 Publication Date 7/4/2017 
Target
Name:
Orexin receptor type 2
Synonyms:
HCRTR2 OX2R_HUMAN Orexin receptor type 2 (OR-2) Orexin receptor type 2 (OX2R) Ox-2-R | Ox2-R
Type:
Protein
Mol. Mass.:
50710.53
Organism:
Homo sapiens (Human)
Description:
O43614
Residue:
444
  
Inhibitor
Name:
BDBM164140
Synonyms:
BDBM255252 US9637496, 270 | US9695183, 270
Type:
Small organic molecule
Emp. Form.:
C23H19BrFN7O
Mol. Mass.:
508.346
SMILES:
Fc1cccc(C(=O)N2C3CCC2C(C3)Nc2nccn3c(Br)cnc23)c1-c1ncccn1
: