Target
D(2) dopamine receptor
Ligand
BDBM50130290
Substrate
Ki
63±n/a nM
Comments
PDSP_1247
Citation
 Kroeze, WKHufeisen, SJPopadak, BARenock, SMSteinberg, SErnsberger, PJayathilake, KMeltzer, HYRoth, BL H1-histamine receptor affinity predicts short-term weight gain for typical and atypical antipsychotic drugs. Neuropsychopharmacology 28:519-26 (2003)  
Target
Name:
D(2) dopamine receptor
Synonyms:
D(2) dopamine receptor DOPAMINE D2 Long DRD2 Dopamine D2 receptor Dopamine D2 receptor (D2R) Dopamine2-like | d2
Type:
Cell-surface receptors
Mol. Mass.:
50647.10
Organism:
Homo sapiens (Human)
Description:
P14416
Residue:
443
  
Inhibitor
Name:
BDBM50130290
Synonyms:
3-Ethyl-2-methyl-5-morpholin-4-ylmethyl-1,5,6,7-tetrahydro-indol-4-one CHEMBL460 Moban
Type:
Small organic molecule
Emp. Form.:
C16H24N2O2
Mol. Mass.:
276.374
SMILES:
CCc1c(C)[nH]c2CCC(CN3CCOCC3)C(=O)c12
: