Target
Gamma-aminobutyric acid type B receptor subunit 1
Ligand
BDBM50133817
Substrate
Ki
>10000±n/a nM
Comments
PDSP_7569
Citation
 Valenzano, KJGrant, ERWu, GHachicha, MSchmid, LTafesse, LSun, QRotshteyn, YFrancis, JLimberis, JMalik, SWhittemore, ERHodges, D N-(4-tertiarybutylphenyl)-4-(3-chloropyridin-2-yl)tetrahydropyrazine -1(2H)-carbox-amide (BCTC), a novel, orally effective vanilloid receptor 1 antagonist with analgesic properties: I. in vitro characterization and pharmacokinetic properties. J Pharmacol Exp Ther 306:377-86 (2003)  
Target
Name:
Gamma-aminobutyric acid type B receptor subunit 1
Synonyms:
GABA B GABA uptake GABA-B-R1 GABABR1 Gabbr1 | Gb1
Type:
Enzyme Catalytic Domain
Mol. Mass.:
111548.69
Organism:
Rattus norvegicus (Rat)
Description:
Q9Z0U4
Residue:
991
  
Inhibitor
Name:
BDBM50133817
Synonyms:
4-(3-Chloro-pyridin-2-yl)-piperazine-1-carboxylic acid (4-tert-butyl-phenyl)-amide CHEMBL441472 | N-(4-tert-butylphenyl)-4-(3-chloropyridin-2-yl)piperazine-1-carboxamide
Type:
Small organic molecule
Emp. Form.:
C20H25ClN4O
Mol. Mass.:
372.892
SMILES:
CC(C)(C)c1ccc(NC(=O)N2CCN(CC2)c2ncccc2Cl)cc1
: