Target
Metabotropic glutamate receptor 2
Ligand
BDBM50030630
Substrate
Ki
1100±n/a nM
Comments
PDSP_3105
Citation
 Patel, SKrause, SMHamill, TChaudhary, ABurns, DHGibson, RA In vitro characterization of [3H]MethoxyPyEP, an mGluR5 selective radioligand. Life Sci 73:371-9 (2003)  
Target
Name:
Metabotropic glutamate receptor 2
Synonyms:
GPRC1B GRM2_HUMAN Metabotropic glutamate receptor mGlu2 | metabotropic glutamate 2
Type:
Enzyme
Mol. Mass.:
95584.88
Organism:
Homo sapiens (Human)
Description:
Q14416
Residue:
872
  
Inhibitor
Name:
BDBM50030630
Synonyms:
(RS)-1-aminoindan-1,5-dicarboxylic acid 1-Amino-indan-1,5-dicarboxylic acid(RS-AIDA) AIDC GNF-Pf-1401
Type:
Small organic molecule
Emp. Form.:
C11H11NO4
Mol. Mass.:
221.2093
SMILES:
NC1(CCc2cc(ccc12)C(O)=O)C(O)=O
: