Target
D(1A) dopamine receptor
Ligand
BDBM86180
Substrate
Ki
0.12±n/a nM
Comments
PDSP_1685
Citation
 Neumeyer, JLKula, NSBergman, JBaldessarini, RJ Receptor affinities of dopamine D1 receptor-selective novel phenylbenzazepines. Eur J Pharmacol 474:137-40 (2003)  
Target
Name:
D(1A) dopamine receptor
Synonyms:
DOPAMINE D1 Dopamine D1 high Dopamine receptor Dopamine1-like Drd1a
Type:
Enzyme Catalytic Domain
Mol. Mass.:
49429.75
Organism:
RAT
Description:
P18901
Residue:
446
  
Inhibitor
Name:
BDBM86180
Synonyms:
CAS_87075-17-0 SCH 23390 US9359372, SCH23390
Type:
Small organic molecule
Emp. Form.:
C17H18ClNO
Mol. Mass.:
287.784
SMILES:
CN1CCc2cc(Cl)c(O)cc2C(C1)c1ccccc1
: