Target
D(1B) dopamine receptor
Ligand
BDBM86270
Substrate
Ki
13.7±n/a nM
Comments
PDSP_4930
Citation
 Neumeyer, JLKula, NSBergman, JBaldessarini, RJ Receptor affinities of dopamine D1 receptor-selective novel phenylbenzazepines. Eur J Pharmacol 474:137-40 (2003)  
Target
Name:
D(1B) dopamine receptor
Synonyms:
D(5) dopamine receptor DOPAMINE D5 DRD1L2 DRD5_HUMAN | dopamine receptor D5
Type:
Protein
Mol. Mass.:
52943.41
Organism:
Homo sapiens (Human)
Description:
P21918
Residue:
477
  
Inhibitor
Name:
BDBM86270
Synonyms:
MCL-205
Type:
Small organic molecule
Emp. Form.:
C17H18BrNO2
Mol. Mass.:
348.234
SMILES:
Cc1cccc(c1)C1CNCCc2c(Br)c(O)c(O)cc12
: