Target
Beta-2 adrenergic receptor
Ligand
BDBM25761
Substrate
Ki
0.8±n/a nM
Comments
PDSP_1539
Citation
 Hoffmann, CLeitz, MROberdorf-Maass, SLohse, MJKlotz, KN Comparative pharmacology of human beta-adrenergic receptor subtypes--characterization of stably transfected receptors in CHO cells. Naunyn Schmiedebergs Arch Pharmacol 369:151-9 (2004)  
Target
Name:
Beta-2 adrenergic receptor
Synonyms:
ADRB2 ADRB2_HUMAN Beta-2 adrenoceptor | Beta-2 adrenoreceptor
Type:
Mol. Mass.:
46461.69
Organism:
Homo sapiens (Human)
Description:
P07550
Residue:
413
  
Inhibitor
Name:
BDBM25761
Synonyms:
Anapriline CHEMBL27 PROPRANOLOL, d PROPRANOLOL,(+) Propanolol Propranolol | [2-hydroxy-3-(naphthalen-1-yloxy)propyl](propan-2-yl)amine
Type:
Small organic molecule
Emp. Form.:
C16H21NO2
Mol. Mass.:
259.3434
SMILES:
CC(C)NCC(O)COc1cccc2ccccc12
: