Target
Gamma-aminobutyric acid receptor subunit alpha-1
Ligand
BDBM26266
Substrate
Ki
13.5±n/a nM
Comments
PDSP_2001
Citation
 Sullivan, SKPetroski, REVerge, GGross, RSFoster, ACGrigoriadis, DE Characterization of the interaction of indiplon, a novel pyrazolopyrimidine sedative-hypnotic, with the GABAA receptor. J Pharmacol Exp Ther 311:537-46 (2004)  
Target
Name:
Gamma-aminobutyric acid receptor subunit alpha-1
Synonyms:
Benzodiazepine central GABA A Benzodiazepine GABA A Benzodiazepine Type II GABA A Benzodiazepine Type IIM GABA A Benzodiazepine omega2 GABA A alpha1 GABA receptor alpha-1 subunit GABA-PICROTOXIN Gabra-1 TBPS
Type:
Enzyme
Mol. Mass.:
51770.21
Organism:
Rattus norvegicus (Rat)
Description:
P62813
Residue:
455
  
Inhibitor
Name:
BDBM26266
Synonyms:
Ambien Dalparan ZPM Zolpidem tartrate
Type:
Small organic molecule
Emp. Form.:
C19H21N3O
Mol. Mass.:
307.3895
SMILES:
CN(C)C(=O)Cc1c(nc2ccc(C)cn12)-c1ccc(C)cc1
: