Target
5-hydroxytryptamine receptor 2C
Ligand
BDBM28582
Substrate
Ki
8.32±n/a nM
Comments
PDSP_721
Citation
 Knight, ARMisra, AQuirk, KBenwell, KRevell, DKennett, GBickerdike, M Pharmacological characterisation of the agonist radioligand binding site of 5-HT(2A), 5-HT(2B) and 5-HT(2C) receptors. Naunyn Schmiedebergs Arch Pharmacol 370:114-23 (2004)  
Target
Name:
5-hydroxytryptamine receptor 2C
Synonyms:
5-HT-2C 5-HT2C-INI 5-HTR2C 5-hydroxytryptamine receptor 2C (5-HT-2C) 5HT-1C HTR1C Serotonin (5-HT3) receptor Serotonin Receptor 2C
Type:
G Protein-Coupled Receptor (GPCR)
Mol. Mass.:
51836.79
Organism:
Homo sapiens (Human)
Description:
P28335
Residue:
458
  
Inhibitor
Name:
BDBM28582
Synonyms:
1-(4-iodo-2,5-dimethoxyphenyl)propan-2-amine DOI DOI,(-) [125I]4-iodo-2,5-dimethoxyphenylisopropylamine | [125I]DOI
Type:
radiolabeled ligand
Emp. Form.:
C11H16INO2
Mol. Mass.:
321.1547
SMILES:
COc1cc(CC(C)N)c(OC)cc1I
: