Target
Nociceptin receptor
Ligand
BDBM85822
Substrate
Ki
11.48±n/a nM
Comments
PDSP_1267
Citation
 Carr&aagrovr;, GRizzi, AGuerrini, RBarnes, TAMcDonald, JHebbes, CPMela, FKenigs, VAMarzola, GRizzi, DGavioli, EZucchini, SRegoli, DMorari, MSalvadori, SRowbotham, DJLambert, DGKapusta, DRCalo', G [(pF)Phe4,Arg14,Lys15]N/OFQ-NH2 (UFP-102), a highly potent and selective agonist of the nociceptin/orphanin FQ receptor. J Pharmacol Exp Ther 312:1114-23 (2005)  
Target
Name:
Nociceptin receptor
Synonyms:
Nociceptin/Orphanin FQ, NOP receptor OPRX_PIG
Type:
Enzyme Catalytic Domain
Mol. Mass.:
40620.31
Organism:
GUINEA PIG
Description:
Nociceptin/Orphanin FQ, NOP receptor 0 GUINEA PIG::P79292
Residue:
370
  
Inhibitor
Name:
BDBM85822
Synonyms:
Demethyl-AMPA OFQ/N (1-11) | OFQ/N (1-11),[Tyr10]
Type:
Small organic molecule
Emp. Form.:
C61H100N22O15
Mol. Mass.:
1381.5851
SMILES:
[#6]-[#6@@H](-[#8])-[#6@H](-[#7]-[#6](=O)-[#6@H](-[#6]-c1ccccc1)-[#7]-[#6](=O)-[#6]-[#7]-[#6](=O)-[#6]-[#7]-[#6](=O)-[#6@@H](-[#7])-[#6]-c1ccccc1)-[#6](=O)-[#7]-[#6]-[#6](=O)-[#7]-[#6@@H](-[#6])-[#6](=O)-[#7]-[#6@@H](-[#6]-[#6]-[#6]\[#7]=[#6](\[#7])-[#7])-[#6](=O)-[#7]-[#6@@H](-[#6]-[#6]-[#6]-[#6]-[#7])-[#6](=O)-[#7]-[#6@@H](-[#6]-[#8])-[#6](=O)-[#7]-[#6@@H](-[#6])-[#6](=O)-[#7]-[#6@@H](-[#6]-[#6]-[#6]\[#7]=[#6](\[#7])-[#7])-[#6](=O)-[#7]-[#6@@H](-[#6]-[#6]-[#6]-[#6]-[#7])-[#6](-[#7])=O
: