Target
Hrh3 protein
Ligand
BDBM27213
Substrate
Ki
0.63±n/a nM
Comments
PDSP_2989
Citation
 Esbenshade, TAFox, GBKrueger, KMMiller, TRKang, CHDenny, LIWitte, DGYao, BBPan, LWetter, JMarsh, KBennani, YLCowart, MDSullivan, JPHancock, AA Pharmacological properties of ABT-239 [4-(2-{2-[(2R)-2-Methylpyrrolidinyl]ethyl}-benzofuran-5-yl)benzonitrile]: I. Potent and selective histamine H3 receptor antagonist with drug-like properties. J Pharmacol Exp Ther 313:165-75 (2005)  
Target
Name:
Hrh3 protein
Synonyms:
HISTAMINE H3 Hrh3 protein
Type:
Enzyme Catalytic Domain
Mol. Mass.:
37860.96
Organism:
RAT
Description:
Q5PPG3
Residue:
344
  
Inhibitor
Name:
BDBM27213
Synonyms:
4-[3-(4-cyclopropanecarbonylphenoxy)propyl]-1H-imidazole CHEMBL1795025 | Ciproxifan
Type:
Small organic molecule
Emp. Form.:
C16H18N2O2
Mol. Mass.:
270.3263
SMILES:
O=C(C1CC1)c1ccc(OCCCc2cnc[nH]2)cc1
: