Target
Estrogen receptor
Ligand
BDBM86678
Substrate
Ki
>10000±n/a nM
Comments
PDSP_5075
Citation
 Kurata, YTabata, YShinei, RIizuka, YMasuda, NTKurihara, KOkonogi, THoshiko, S Endocrinological properties of two novel nonsteroidal progesterone receptor modulators, CP8816 and CP8863. J Pharmacol Exp Ther 313:916-20 (2005)  
Target
Name:
Estrogen receptor
Synonyms:
ER ESR ESR1_HUMAN Estrogen receptor Estrogen receptor (ER-alpha) Estrogen receptor alpha (ER) Nuclear receptor subfamily 3 group A member 1
Type:
Protein
Mol. Mass.:
66230.44
Organism:
Homo sapiens (Human)
Description:
P03372
Residue:
595
  
Inhibitor
Name:
BDBM86678
Synonyms:
CP8816
Type:
Small organic molecule
Emp. Form.:
C20H28N2O4
Mol. Mass.:
360.4473
SMILES:
COC1C=C2C=C3N(C)C(=O)C(C)=C3[C@@H](C)[C@]2(C)CC1OC(=O)N(C)C
: