Target
Glucocorticoid receptor
Ligand
BDBM86679
Substrate
Ki
>10000±n/a nM
Comments
PDSP_5076
Citation
 Kurata, YTabata, YShinei, RIizuka, YMasuda, NTKurihara, KOkonogi, THoshiko, S Endocrinological properties of two novel nonsteroidal progesterone receptor modulators, CP8816 and CP8863. J Pharmacol Exp Ther 313:916-20 (2005)  
Target
Name:
Glucocorticoid receptor
Synonyms:
GCR_HUMAN GRL Glucocorticoid receptor (GRFP) Nuclear receptor subfamily 3 group C member 1
Type:
Enzyme
Mol. Mass.:
85656.87
Organism:
Homo sapiens (Human)
Description:
P04150
Residue:
777
  
Inhibitor
Name:
BDBM86679
Synonyms:
CP8863
Type:
Small organic molecule
Emp. Form.:
C18H24N2O4
Mol. Mass.:
332.3942
SMILES:
CNC(=O)OC1C[C@@]2(C)[C@H](C)C3=C(C)C(=O)N(C)C3=CC2=CC1O
: