Target
Sodium-dependent dopamine transporter
Ligand
BDBM86207
Substrate
Ki
128±n/a nM
Comments
PDSP_556
Citation
 Ukairo, OTBondi, CDNewman, AHKulkarni, SSKozikowski, APPan, SSurratt, CK Recognition of benztropine by the dopamine transporter (DAT) differs from that of the classical dopamine uptake inhibitors cocaine, methylphenidate, and mazindol as a function of a DAT transmembrane 1 aspartic acid residue. J Pharmacol Exp Ther 314:575-83 (2005)  
Target
Name:
Sodium-dependent dopamine transporter
Synonyms:
DA transporter SC6A3_RAT Sodium-dependent dopamine transporter | Sodium-dependent dopamine transporter (DAT)
Type:
Multi-pass membrane protein
Mol. Mass.:
68749.45
Organism:
Rattus norvegicus (rat)
Description:
P23977
Residue:
619
  
Inhibitor
Name:
BDBM86207
Synonyms:
CAS_50-36-2 NSC_446220
Type:
Small organic molecule
Emp. Form.:
C17H21NO4
Mol. Mass.:
303.3529
SMILES:
COC(=O)C1C2CCC(CC1OC(=O)c1ccccc1)N2C
: