Target
D(3) dopamine receptor
Ligand
BDBM50240701
Substrate
Ki
300±n/a nM
Comments
PDSP_3764
Citation
 Burstein, ESMa, JWong, SGao, YPham, EKnapp, AENash, NROlsson, RDavis, REHacksell, UWeiner, DMBrann, MR Intrinsic efficacy of antipsychotics at human D2, D3, and D4 dopamine receptors: identification of the clozapine metabolite N-desmethylclozapine as a D2/D3 partial agonist. J Pharmacol Exp Ther 315:1278-87 (2005)  
Target
Name:
D(3) dopamine receptor
Synonyms:
DOPAMINE D3 DRD3_HUMAN Dopamine D3 receptor (D3) Dopamine receptor Dopamine receptor D3
Type:
Mol. Mass.:
44243.43
Organism:
Homo sapiens (Human)
Description:
Residue:
400
  
Inhibitor
Name:
BDBM50240701
Synonyms:
2-Methyl-10-piperazin-1-yl-4H-3-thia-4,9-diaza-benzo[f]azulene CHEMBL1125 olanzapine, N-desmethyl
Type:
Small organic molecule
Emp. Form.:
C16H18N4S
Mol. Mass.:
298.406
SMILES:
Cc1cc2c(Nc3ccccc3N=C2N2CCNCC2)s1
: