Target
Neuropeptide Y receptor type 2
Ligand
BDBM86732
Substrate
Ki
>10000±n/a nM
Comments
PDSP_6328
Citation
 Kakui, NTanaka, JTabata, YAsai, KMasuda, NMiyara, TNakatani, YOhsawa, FNishikawa, NSugai, MSuzuki, MAoki, KKitaguchi, H Pharmacological characterization and feeding-suppressive property of FMS586 [3-(5,6,7,8-tetrahydro-9-isopropyl-carbazol-3-yl)-1-methyl-1-(2-pyridin-4-yl-ethyl)-urea hydrochloride], a novel, selective, and orally active antagonist for neuropeptide Y Y5 receptor. J Pharmacol Exp Ther 317:562-70 (2006)  
Target
Name:
Neuropeptide Y receptor type 2
Synonyms:
NPY-Y2 NPY2-R NPY2R_HUMAN Y2 receptor | neuropeptide Y receptor Y2
Type:
Enzyme Catalytic Domain
Mol. Mass.:
42734.65
Organism:
Homo sapiens (Human)
Description:
NPY-Y2 NPY2R HUMAN::P49146
Residue:
381
  
Inhibitor
Name:
BDBM86732
Synonyms:
3-(5,6,7,8-tetrahydro-9-isopropyl-carbazol-3-yl)-1-methyl-1-(2-pyridin-4-yl-ethyl)-ureanbsphydrochloride FMS586
Type:
Small organic molecule
Emp. Form.:
C24H30N4O
Mol. Mass.:
390.5212
SMILES:
CC(C)n1c2CCCCc2c2cc(NC(=O)N(C)CCc3ccncc3)ccc12
: