Target
Sodium-dependent noradrenaline transporter
Ligand
BDBM87043
Substrate
Ki
6±n/a nM
Comments
PDSP_8628
Citation
 Fish, PVDeur, CGan, XGreene, KHoople, DMackenny, MPara, KSReeves, KRyckmans, TStiff, CStobie, AWakenhut, FWhitlock, GA Design and synthesis of morpholine derivatives. SAR for dual serotonin & noradrenaline reuptake inhibition. Bioorg Med Chem Lett 18:2562-6 (2008)  
Target
Name:
Sodium-dependent noradrenaline transporter
Synonyms:
Monoamine transporter NET Noradrenaline Transporter (NET) Norepinephrine transporter protein (NET) SLC6A2 Sodium-dependent noradrenaline transporter (NET) | Solute carrier family 6 member 2
Type:
Multi-pass membrane protein
Mol. Mass.:
69337.72
Organism:
Homo sapiens (Human)
Description:
P23975
Residue:
617
  
Inhibitor
Name:
BDBM87043
Synonyms:
(R)-2-((R)-(4-fluoro-2-methoxyphenoxy)(phenyl)methyl)morpholine CAS_44449768 NSC_44449768 | NSC_44449792
Type:
Small organic molecule
Emp. Form.:
C18H20FNO3
Mol. Mass.:
317.3547
SMILES:
COc1cc(F)ccc1OC(C1CNCCO1)c1ccccc1
: