Target
AP-2 complex subunit sigma
Ligand
BDBM81790
Substrate
Ki
>10000±n/a nM
Comments
PDSP_287
Citation
 Abbas, AIHedlund, PBHuang, XPTran, TBMeltzer, HYRoth, BL Amisulpride is a potent 5-HT7 antagonist: relevance for antidepressant actions in vivo. Psychopharmacology (Berl) 205:119-28 (2009)  
Target
Name:
AP-2 complex subunit sigma
Synonyms:
AP-2 complex subunit sigma Ap17 Claps2 | Sigma-2
Type:
Enzyme Catalytic Domain
Mol. Mass.:
17016.49
Organism:
RAT
Description:
Sigma-2 0 RAT::P62744
Residue:
142
  
Inhibitor
Name:
BDBM81790
Synonyms:
Amisulpride NSC_2159 US10259786, Amisulpride
Type:
Small organic molecule
Emp. Form.:
C17H27N3O4S
Mol. Mass.:
369.479
SMILES:
CCN1CCCC1CNC(=O)c1cc(c(N)cc1OC)S(=O)(=O)CC
: