Target
Isocitrate dehydrogenase [NADP] cytoplasmic [R132H]
Ligand
BDBM278595
Substrate
Meas. Tech.
Inhibitory Activity Against IDH1R132H and IDH1R132C Enzymes
pH
7.5±n/a
Temperature
298.15±n/a K
IC50
10.00±n/a nM
Comments
extracted
Citation
 Saito, SItoh, MFujisawa, TSaito, HKiyotsuka, YWatanabe, HMatsunaga, HKagoshima, YSuzuki, TOgawara, YKitabayashi, K Isoxazole derivative as mutant isocitrate dehydrogenase 1 inhibitor US Patent  US10040791 Publication Date 8/7/2018 
Target
Name:
Isocitrate dehydrogenase [NADP] cytoplasmic [R132H]
Synonyms:
Cytosolic NADP-isocitrate dehydrogenase (IDH1)(R132H) IDH1 R132H IDHC_HUMAN Isocitrate dehydrogenase 1 mutant (R132H) Isocitrate dehydrogenase [NADP] cytoplasmic (IDH1)(R132H) PICD
Type:
Protein
Mol. Mass.:
46641.74
Organism:
Homo sapiens (Human)
Description:
Human IDH1 R132H (SEQ ID No. 2 in patent). First three are removed. Google patent parsed wrong.
Residue:
414
  
Inhibitor
Name:
BDBM278595
Synonyms:
(2E)-3-(1-{[5-(1- Methoxycyclopropyl)-3-(2,4,6- trichlorophenyl)-1,2-oxazol-4- yl]carbonyl}-3-methyl-1H- indol-4-yl)prop-2-enoic acid | US10040791, Example 57
Type:
Small organic molecule
Emp. Form.:
C26H19Cl3N2O5
Mol. Mass.:
545.798
SMILES:
COC1(CC1)c1onc(c1C(=O)n1cc(C)c2c(\C=C\C(O)=O)cccc12)-c1c(Cl)cc(Cl)cc1Cl
: