Target
Zinc finger protein GLI1
Ligand
BDBM89269
Substrate
Meas. Tech.
Dose response confirmation of uHTS antagonist hits from Gli-SUFU in a luminescent reporter assay
IC50
1990±n/a nM
Citation
 PubChem, PC Dose response confirmation of uHTS antagonist hits from Gli-SUFU in a luminescent reporter assay PubChem Bioassay (2012)[AID] 
Target
Name:
Zinc finger protein GLI1
Synonyms:
GLI1_MOUSE Gli1 | Glioma-associated oncogene homolog
Type:
PROTEIN
Mol. Mass.:
118579.34
Organism:
Mus musculus
Description:
EBI_101259
Residue:
1111
  
Inhibitor
Name:
BDBM89269
Synonyms:
(E)-N-[4-(1H-benzimidazol-2-yl)phenyl]-3-(2-furanyl)-2-propenamide (E)-N-[4-(1H-benzimidazol-2-yl)phenyl]-3-(furan-2-yl)prop-2-enamide N-[4-(1H-Benzoimidazol-2-yl)-phenyl]-3-furan-2-yl-acrylamide cid_782243
Type:
Small organic molecule
Emp. Form.:
C20H15N3O2
Mol. Mass.:
329.352
SMILES:
O=C(Nc1ccc(cc1)-c1nc2ccccc2[nH]1)\C=C\c1ccco1
: