Target
Methyl-accepting chemotaxis protein NahY
Ligand
BDBM26109
Substrate
Meas. Tech.
Isothermal Titration Calorimetry
Temperature
293.15±0 K
Kd
9.2e+4±n/a nM
Citation
 Lacal, JAlfonso, CLiu, XParales, REMorel, BConejero-Lara, FRivas, GDuque, ERamos, JLKrell, T Identification of a chemoreceptor for tricarboxylic acid cycle intermediates: differential chemotactic response towards receptor ligands. J Biol Chem 285:23126-36 (2010)  
Target
Name:
Methyl-accepting chemotaxis protein NahY
Synonyms:
Methyl-accepting chemotaxis protein (McpS) nahY
Type:
Protein
Mol. Mass.:
58698.14
Organism:
Pseudomonas putida (Arthrobacter siderocapsulatus)
Description:
Q9Z429
Residue:
538
  
Inhibitor
Name:
BDBM26109
Synonyms:
Butyrate butanoic acid, 4
Type:
Small organic molecule
Emp. Form.:
C4H8O2
Mol. Mass.:
88.1051
SMILES:
CCCC(O)=O
: