Target
Bifunctional aspartokinase/homoserine dehydrogenase 1
Ligand
BDBM93001
Substrate
Meas. Tech.
Inhibition Assay
Ki
12000000±3000000 nM
Citation
 Angeles, TSHunsley, JRViola, RE Reversal of enzyme regiospecificity with alternative substrates for aspartokinase I from Escherichia coli. Biochemistry 31:799-805 (1992)  
Target
Name:
Bifunctional aspartokinase/homoserine dehydrogenase 1
Synonyms:
AK1H_ECOLI Bifunctional aspartokinase/homoserine dehydrogenase 1 thrA1 | thrA2
Type:
Protein
Mol. Mass.:
89109.15
Organism:
Escherichia coli
Description:
P00561
Residue:
820
  
Inhibitor
Name:
BDBM93001
Synonyms:
O-phospho-L-serine
Type:
Small molecule
Emp. Form.:
C3H6NO6P
Mol. Mass.:
183.0577
SMILES:
[NH3+][C@@H](COP([O-])([O-])=O)C([O-])=O
: