Target
Prolyl hydroxylase EGLN3
Ligand
BDBM93420
Substrate
Meas. Tech.
PHD Enzymatic Assay
IC50
77±n/a nM
Citation
 Murray, JKBalan, CAllgeier, AMKasparian, AViswanadhan, VWilde, CAllen, JRYoder, SCBiddlecome, GHungate, RWMiranda, LP Dipeptidyl-quinolone derivatives inhibit hypoxia inducible factor-1a prolyl hydroxylases-1, -2, and -3 with altered selectivity. J Comb Chem 12:676-86 (2010)  
Target
Name:
Prolyl hydroxylase EGLN3
Synonyms:
EGLN3 Egl nine homolog 3 (EGLIN3) | Egl nine homolog 3 (EGLN3)
Type:
Protein
Mol. Mass.:
27265.54
Organism:
Homo sapiens (Human)
Description:
Q9H6Z9
Residue:
239
  
Inhibitor
Name:
BDBM93420
Synonyms:
PHD Inhibitor, 12{3,1,4}
Type:
Small molecule
Emp. Form.:
C38H45N5O8
Mol. Mass.:
699.7926
SMILES:
CC(C)C[C@H](NC(=O)[C@H](Cc1cccc2ccccc12)NC(=O)C(C)(C)C)C(=O)NCc1ccc2n(C)c(=O)c(C(=O)NCC(O)=O)c(O)c2c1
: