Target
Prolyl hydroxylase EGLN3
Ligand
BDBM93423
Substrate
Meas. Tech.
PHD Enzymatic Assay
IC50
13.5±0.0 nM
Citation
 Murray, JKBalan, CAllgeier, AMKasparian, AViswanadhan, VWilde, CAllen, JRYoder, SCBiddlecome, GHungate, RWMiranda, LP Dipeptidyl-quinolone derivatives inhibit hypoxia inducible factor-1a prolyl hydroxylases-1, -2, and -3 with altered selectivity. J Comb Chem 12:676-86 (2010)  
Target
Name:
Prolyl hydroxylase EGLN3
Synonyms:
EGLN3 Egl nine homolog 3 (EGLIN3) | Egl nine homolog 3 (EGLN3)
Type:
Protein
Mol. Mass.:
27265.54
Organism:
Homo sapiens (Human)
Description:
Q9H6Z9
Residue:
239
  
Inhibitor
Name:
BDBM93423
Synonyms:
PHD Inhibitor, 12{2,3,2} | PHD Inhibitor, 12{2,4,2}
Type:
Small molecule
Emp. Form.:
C34H35N5O8
Mol. Mass.:
641.6704
SMILES:
CC(=O)N[C@H](Cc1ccccc1)C(=O)N[C@H](Cc1ccccc1)C(=O)NCc1ccc2n(C)c(=O)c(C(=O)NCC(O)=O)c(O)c2c1
: