Target
Perilipin-1
Ligand
BDBM94597
Substrate
IC50
12946±n/a nM
Citation
 PubChem, PC Counterscreen for inhibitors of the interaction of the lipase co-activator protein, abhydrolase domain containing 5 (ABHD5) with perilipin-5 (MLDP; PLIN5) PubChem Bioassay (2012)[AID] 
Target
Name:
Perilipin-1
Synonyms:
PERI PLIN1 | PLIN1_HUMAN
Type:
Enzyme Catalytic Domain
Mol. Mass.:
55988.69
Organism:
Homo sapiens (Human)
Description:
gi_223718203
Residue:
522
  
Inhibitor
Name:
BDBM94597
Synonyms:
(Z)-2-butenedioate;10-(1-methyl-4-piperidinylidene)-5H-benzo[1,2]cyclohepta[3,4-b]thiophen-4-one 10-(1-methyl-4-piperidylidene)-5H-benzo[1,2]cyclohepta[3,4-b]thiophen-4-one;maleate Ketotifen fumarate SMR001307257 US9333199, KETOTIFEN cid_5282408
Type:
Small organic molecule
Emp. Form.:
C19H19NOS
Mol. Mass.:
309.425
SMILES:
[#6]-[#7]-1-[#6]-[#6]\[#6](-[#6]-[#6]-1)=[#6]-1/c2ccsc2-[#6](=O)-[#6]-c2ccccc-12
: