Target
Perilipin-5
Ligand
BDBM94593
Substrate
IC50
2546±n/a nM
Citation
 PubChem, PC Luminescence-based biochemical high throughput dose response assay for inhibitors of the interaction of the lipase co-activator protein, abhydrolase domain containing 5 (ABHD5) with perilipin-5 (MLDP; PLIN5) PubChem Bioassay (2012)[AID] 
Target
Name:
Perilipin-5
Synonyms:
LSDP5 PAT-1 PLIN5_HUMAN
Type:
Enzyme Catalytic Domain
Mol. Mass.:
50774.20
Organism:
Homo sapiens (Human)
Description:
gi_116292172
Residue:
463
  
Inhibitor
Name:
BDBM94593
Synonyms:
2-(diethylamino)ethyl 2-phenylbutanoate;2-hydroxypropane-1,2,3-tricarboxylic acid 2-hydroxypropane-1,2,3-tricarboxylic acid;2-phenylbutanoic acid 2-(diethylamino)ethyl ester MLS001148168 cid_117176 | citric acid;2-phenylbutyric acid 2-(diethylamino)ethyl ester
Type:
Small organic molecule
Emp. Form.:
C16H25NO2
Mol. Mass.:
263.3752
SMILES:
CCC(C(=O)OCCN(CC)CC)c1ccccc1
: