Target
Neutrophil elastase
Ligand
BDBM405517
Substrate
Meas. Tech.
Enzyme Inhibition Assay
IC50
<1.000±n/a nM
Citation
 Gnamm, COost, TPeters, SRudolf, K Substituted bicyclic dihydropyrimidinones and their use as inhibitors of neutrophil elastase activity US Patent  USRE47493 Publication Date 7/9/2019 
Target
Name:
Neutrophil elastase
Synonyms:
Bone marrow serine protease Coagulation factor X ELANE Elastase HLE Leukocyte elastase Medullasin Neutrophil elastase (HNE) PMN elastase Trypsin
Type:
Enzyme
Mol. Mass.:
28532.38
Organism:
Homo sapiens (Human)
Description:
P08246
Residue:
267
  
Inhibitor
Name:
BDBM405517
Synonyms:
USRE47493, Example 70.15
Type:
Small organic molecule
Emp. Form.:
C29H27F3N4O3
Mol. Mass.:
536.5449
SMILES:
CC1CC(CNC(=O)N2C(C3=C(CCCC3=O)N(C2=O)c2cccc(c2)C(F)(F)F)c2ccc(cc2)C#N)C1
: