Target
RecBCD enzyme subunit RecD
Ligand
BDBM50013111
Substrate
IC50
52939±n/a nM
Citation
 PubChem, PC Absorbance-based bacterial cell-based high throughput dose response assay to identify inhibitors of RecBCD PubChem Bioassay (2013)[AID] 
Target
Name:
RecBCD enzyme subunit RecD
Synonyms:
RECD_ECOLI hopE | recD
Type:
Enzyme Catalytic Domain
Mol. Mass.:
66906.68
Organism:
Escherichia coli str. K-12 substr. MG1655
Description:
gi_16130723
Residue:
608
  
Inhibitor
Name:
BDBM50013111
Synonyms:
1-((2R,5S)-5-(hydroxymethyl)-2,5-dihydrofuran-2-yl)-5-methylpyrimidine-2,4(1H,3H)-dione 1-(5-Hydroxymethyl-2,5-dihydro-furan-2-yl)-5-methyl-1H-pyrimidine-2,4-dione 2',3'-didehydro-3'-deoxythymidine 3'-deoxy-2',3'-didehydrothymidine BMY-27857 STAVUDINE Zerit xr cid_5155 | d4T
Type:
Small organic molecule
Emp. Form.:
C10H12N2O4
Mol. Mass.:
224.2133
SMILES:
Cc1cn([C@@H]2O[C@H](CO)C=C2)c(=O)[nH]c1=O
: