Target
Guanine nucleotide-binding protein subunit alpha-15
Ligand
BDBM81459
Substrate
IC50
>29907±n/a nM
Citation
 PubChem, PC Counterscreen for agonists of the human trace amine associated receptor 1 (TAAR1): Fluorescence-based cell-based high throughput dose response assay to identify nonselective Ga16 antagonists PubChem Bioassay (2013)[AID] 
Target
Name:
Guanine nucleotide-binding protein subunit alpha-15
Synonyms:
G-protein subunit alpha-16 GNA15 GNA16 | guanine nucleotide-binding protein subunit alpha-15
Type:
Protein
Mol. Mass.:
43577.62
Organism:
Homo sapiens (Human)
Description:
P30679
Residue:
374
  
Inhibitor
Name:
BDBM81459
Synonyms:
4-(2-aminopropyl)phenol;hydrobromide Hydroxyamphetamine,(+/-) | NSC_3651
Type:
Small organic molecule
Emp. Form.:
C9H13NO
Mol. Mass.:
151.2056
SMILES:
CC(N)Cc1ccc(O)cc1
: